wiki:dports

Dan Ports

dports AT macports.org

http://drkp.net/

Reported Tickets

#39680
stog: dependency on texlive-bin is likely incorrect

Assigned Tickets

#29794
emacs-app @23.3_0 Problem using tramp in emacs.app: "ControlPath too long"
#43189
No latex-previews when using pgf 3.0.0 in emacs-app
#43878
emacs hangs when executing 'gnus'
#46845
Gnucash @ 2.6.5 Fails when printing Invoice
#50231
emacs-app does not emulate three-button mouse
#50736
org-mode @8.3.3, org-mode-devel @devel: emacs-24.5 hangs with 100% CPU use
#51456
gnucash build failure with guile and guile18 installed
#56423
emacs-devel @20170918 as X client cannot be used with recent fontconfig @2.13.0_0 and non-C locale
#57398
biblatex and biber versions incompatible with each other
#57425
emacs-app or emacs-app-devel crashes on menu access with Tramp file open
#57427
gnucash @3.3.0 upgrade fails due to unknown option "-Wno-register"
#57676
sshfs 2.x unable to create mount points (Sierra/High Sierra and later)
#57931
emacs-app-devel @20190111_0: menu bar requires 2 clicks, is unresponsive, or has delays
#58365
gnucash: Requires py-gobject3
#59209
gnucash 3.6 fails to build
#59638
emacs: error: use of undeclared identifier 'MD5_DIGEST_SIZE'
#59680
hyperref links are coming out as solid blocks of color
#60391
emacs-app @26.3_5 +imagemagick: Startup Crash
#60513
emacs-app-devel-20200417_0+imagemagick+rsvg.darwin_19.x86_64: unable to access 'http://git.savannah.gnu.org/r/emacs.git/': The requested URL returned error: 502
#60708
mit-scheme: Update to 10.1.11
#60869
texlive-bin: building under --with-no-root-privileges fails attepting to create dir /Library/TeX
#60979
texlive-bin @2020.54632_2+x11 build failure with mpfr in /usr/local
#60992
emacs-app-devel @20200811_0: missing image-converter.el[.gz | c]
#61011
emacs @27.1 +universal: Undefined symbols for architecture i386: "_rpl_getopt$UNIX2003"
#61112
Defect: gnucash@3.9_0 forgets settings
#61163
emacs @27.1_1 +x11: GLib-GIO-CRITICAL error/warning when running
#61406
emacs @27.1_2+x11: dyld: lazy symbol binding failed: Symbol not found: _aligned_alloc
#61765
gwenhywfar4 @4.20.2 does not build on Big Sur
#62237
texlive +basic +letter "sh: texconfig-sys: command not found"
#62376
texlive-bin tries to install stuff in system space even when macports is confihgured to put everything in home dir. [universal, Big Sur]
#62804
emacs-devel @20210430: error: "Please include config.h first."
#63021
sshfs: update to 3.7.3
#63100
texlive-bin +universal: ranlib: archive member: libxetex.a(libxetex_a-XeTeXFontMgr_Mac.o) cputype (16777223) does not match previous archive members cputype (7) (all members must match)
#63226
biblatex-biber: loadable library and perl binaries are mismatched
#63397
gnucash 4.6 cannot install, cmakefile patches fail
#63994
emacs-app-devel: The installed libgccjit failed to compile and run a test program using the libgccjit library
#64020
texlive-basic: TeX ignores openout_any configuration option
#64331
emacs-app-devel: problems with native compilation
#64636
ipmitool @1.8.18.20210622_1 fails to build on Monterey/M1
#64776
Please upgrade texlive-metapost to metapost 2.01
#64976
emacs @28.1: incomprehensible warnings during running
#65110
texlive-lang-italian was stealth-updated
#65143
sshfs @2.10_1 does not work
#65359
emacs needs -nativecomp on M1 Mac
#65546
Emacs: strange behavior of menu bar (and tool bar)
#65569
emacs and macports-legacy-support
#65720
mit-scheme @9.2_4: configure: error: unrecognized option: `-j1'
#65889
emacs @28.2 configuration error: libgccjit failed to compile and run a test program
#65896
emacs fails to compile on old Mac <= 10.7

On CC

#23143
Add ActiveMQ to Macports.
#27782
problems with ecb
#30998
New port: Marionette Collective
#31402
p5.12-text-bibtex @0.60 Undefined symbols for architecture i386
#32056
picard port
#33187
kdeinit4 doesn't start: complains about dbus not running
#33827
cairo: Undefined symbols _cairo_boilerplate_get_target_by_name _cairo_boilerplate_xrealloc _cairo_boilerplate_xmalloc, and links with libraries it doesn't declare dependencies on
#34846
auctex: add biber variant
#36095
puppet @2.7.6 request installation of emacs major mode for puppet
#37744
sshfs-gui: MacFUSE no longer maintained, replaced by OSXFUSE?
#39424
Ports that use qmake: consider using the new qmake portgroup
#40656
Use -isystem instead of -I in default configure.cppflags
#44654
cpan2port improvements
#45947
ntfs-3g @2014.2.15 Cannot access drive
#46247
cpan2port: fix dependency checking
#48060
canna: building the documentation fails during image conversion
#48690
Upgrading "guile18" fails
#49872
ghostscript: missing dependency on texlive-basic for dvips
#50000
perl5: improve / reimplement packaging
#52398
Remove webkit-gtk and webkit-gtk-2.0
#52411
Update bibledit to use webkit2-gtk
#52810
Enhance buildbot email to include links to failing builds instead of just all builds
#53467
Obsoleted ports hosted on Google Code
#58144
asymptote, pgf, ...: fails to uninstall when texlive is inactive
#58883
dsniff @2.4: error: Berkeley DB with 1.85 compatibility not found
#60995
port_binary_distributable.tcl: Clarify reason for nondistributability
#62643
emacs[[-mac]-app] @27.2 (and 8.2): error: use of undeclared identifier 'MD5_DIGEST_SIZE'
#63004
emacs-app-devel @20210430_1+nativecomp+rsvg does not work on mac OS High Sierra, 10.13.6
#63171
putty @0.70_0+gui conflicts with pssh @2.3.1_1
#64133
emacs-app-devel @20211112 crashes MacBook on macOS Monterey, version 12.0.1
#64134
emacs-devel @20211112 does not become operable on macOS Monterey, version 12.0.1
#65730
gnucash error messages (seems to run fine)

Last modified 6 years ago Last modified on Oct 31, 2016, 9:40:54 AM